Reaction Details
TargetHrh3 protein
LigandBDBM82510
Substrate/Competitorn/a
Ki 76±n/a nM
CommentsPDSP_1481
Citation Ligneau, XGarbarg, MVizuete, MLDiaz, JPurand, KStark, HSchunack, WSchwartz, JC [125I]iodoproxyfan, a new antagonist to label and visualize cerebral histamine H3 receptors. J Pharmacol Exp Ther271:452-9 (1994) Hrh3 protein
Name:Hrh3 protein
Type:Enzyme Catalytic Domain
Mol. Mass.:37860.96
Organism:RAT
Description:Q5PPG3
Residue:344
BDBM82510
NameBDBM82510
Synonyms:Phenylbutanoylhistamine
TypeSmall organic molecule
Emp. Form.C15H19N3O
Mol. Mass.257.3309
SMILESCCCC(=O)NCCc1cnc([nH]1)-c1ccccc1