Reaction Details
TargetThromboxane A2 receptor
LigandBDBM82512
Substrate/Competitorn/a
Ki 3.7±n/a nM
CommentsPDSP_49
Citation D'Angelo, DDDavis, MGAli, SDorn, GW Cloning and pharmacologic characterization of a thromboxane A2 receptor from K562 (human chronic myelogenous leukemia) cells. J Pharmacol Exp Ther271:1034-41 (1994) Thromboxane A2 receptor
Name:Thromboxane A2 receptor
Type:Enyzme
Mol. Mass.:37445.28
Organism:Homo sapiens (Human)
Description:P21731
Residue:343
BDBM82512
NameBDBM82512
Synonyms:CAS_128719-90-4 | I-BOP
TypeSmall organic molecule
Emp. Form.C23H29IO5
Mol. Mass.512.3778
SMILESO[C@@H](COc1ccc(I)cc1)\C=C\[C@H]1[C@H]2CC[C@H](O2)[C@@H]1C\C=C/CCCC(O)=O