Reaction Details
TargetThromboxane A2 receptor
LigandBDBM50008781
Substrate/Competitorn/a
Ki 15±n/a nM
CommentsPDSP_1747
Citation D'Angelo, DDDavis, MGAli, SDorn, GW Cloning and pharmacologic characterization of a thromboxane A2 receptor from K562 (human chronic myelogenous leukemia) cells. J Pharmacol Exp Ther271:1034-41 (1994) Thromboxane A2 receptor
Name:Thromboxane A2 receptor
Type:Enyzme
Mol. Mass.:37445.28
Organism:Homo sapiens (Human)
Description:P21731
Residue:343
BDBM50008781
NameBDBM50008781
Synonyms:7-(3-(2-ethyl-N-phenylhydrazinecarboxamide)-7-oxa-bicyclo[2.2.1]hept-2-yl)-hept-5-enoic acid SQ 29548 | SQ-29548
TypeSmall organic molecule
Emp. Form.C21H29N3O4
Mol. Mass.387.4727
SMILESOC(=O)CCC\C=C/C[C@H]1[C@@H]2CCC(O2)[C@H]1CNNC(=O)Nc1ccccc1