Reaction Details
TargetAlpha-2A adrenergic receptor
LigandBDBM50030623
Substrate/Competitorn/a
Ki 35±n/a nM
CommentsPDSP_1716
Citation O'Rourke, MFIversen, LJLomasney, JWBylund, DB Species orthologs of the alpha-2A adrenergic receptor: the pharmacological properties of the bovine and rat receptors differ from the human and porcine receptors. J Pharmacol Exp Ther271:735-40 (1994) Alpha-2A adrenergic receptor
Name:Alpha-2A adrenergic receptor
Type:Enzyme Catalytic Domain
Mol. Mass.:48998.96
Organism:PIG
Description:adrenergic Alpha2 0 PIG::P18871
Residue:450
BDBM50030623
NameBDBM50030623
Synonyms:6-Chloro-3-methyl-9-(3-methyl-but-2-enyloxy)-2,3,4,5-tetrahydro-1H-benzo[d]azepine SK&F-104078 SKF 104078
TypeSmall organic molecule
Emp. Form.C16H22ClNO
Mol. Mass.279.805
SMILES[#6]-[#7]-1-[#6]-[#6]-c2c(Cl)ccc(-[#8]-[#6]\[#6]=[#6](\[#6])-[#6])c2-[#6]-[#6]-1