Reaction Details
TargetAlpha-2A adrenergic receptor [16-465]
LigandBDBM30993
Substrate/Competitorn/a
Ki 289±n/a nM
CommentsPDSP_1589
Citation O'Rourke, MFIversen, LJLomasney, JWBylund, DB Species orthologs of the alpha-2A adrenergic receptor: the pharmacological properties of the bovine and rat receptors differ from the human and porcine receptors. J Pharmacol Exp Ther271:735-40 (1994) Alpha-2A adrenergic receptor [16-465]
Name:Alpha-2A adrenergic receptor [16-465]
Type:G-protein coupled receptor
Mol. Mass.:48961.69
Organism:Rattus norvegicus (rat)
Description:P22909[16-465]
Residue:450
BDBM30993
NameBDBM30993
Synonyms:Ajmalicine Raubasine cid_251561
TypeSmall organic molecule
Emp. Form.C21H24N2O3
Mol. Mass.352.4269
SMILESCOC(=O)C1=COC(C)C2CN3CCc4c([nH]c5ccccc45)C3CC12