Reaction Details
TargetAlpha-2A adrenergic receptor [16-465]
LigandBDBM81444
Substrate/Competitorn/a
Ki 46±n/a nM
CommentsPDSP_1955
Citation O'Rourke, MFIversen, LJLomasney, JWBylund, DB Species orthologs of the alpha-2A adrenergic receptor: the pharmacological properties of the bovine and rat receptors differ from the human and porcine receptors. J Pharmacol Exp Ther271:735-40 (1994) Alpha-2A adrenergic receptor [16-465]
Name:Alpha-2A adrenergic receptor [16-465]
Type:G-protein coupled receptor
Mol. Mass.:48961.69
Organism:Rattus norvegicus (rat)
Description:P22909[16-465]
Residue:450
BDBM81444
NameBDBM81444
Synonyms:CAS_185453 WB 4101 | WB-4101
TypeSmall organic molecule
Emp. Form.C25H27NO5
Mol. Mass.421.4856
SMILESCOc1cccc(OC)c1OCCNCC1Oc2ccccc2OC1c1ccccc1