Reaction Details
TargetAlpha-2A adrenergic receptor
LigandBDBM81444
Substrate/Competitorn/a
Ki 13.2±n/a nM
CommentsPDSP_1955
Citation O'Rourke, MFIversen, LJLomasney, JWBylund, DB Species orthologs of the alpha-2A adrenergic receptor: the pharmacological properties of the bovine and rat receptors differ from the human and porcine receptors. J Pharmacol Exp Ther271:735-40 (1994) Alpha-2A adrenergic receptor
Name:Alpha-2A adrenergic receptor
Type:Enzyme Catalytic Domain
Mol. Mass.:49275.13
Organism:BOVINE
Description:adrenergic Alpha2 0 BOVINE::Q28838
Residue:452
BDBM81444
NameBDBM81444
Synonyms:CAS_185453 WB 4101 | WB-4101
TypeSmall organic molecule
Emp. Form.C25H27NO5
Mol. Mass.421.4856
SMILESCOc1cccc(OC)c1OCCNCC1Oc2ccccc2OC1c1ccccc1