Reaction Details
TargetCholecystokinin
LigandBDBM50040671
Substrate/Competitorn/a
Ki 0.1±n/a nM
CommentsPDSP_2244
Citation Patel, SSmith, AJChapman, KLFletcher, AEKemp, JAMarshall, GRHargreaves, RJRyecroft, WIversen, LLIversen, SD Biological properties of the benzodiazepine amidine derivative L-740,093, a cholecystokinin-B/gastrin receptor antagonist with high affinity in vitro and high potency in vivo. Mol Pharmacol46:943-8 (1994) Cholecystokinin
Name:Cholecystokinin
Type:Enzyme Catalytic Domain
Mol. Mass.:12528.64
Organism:GUINEA PIG
Description:Cholecystokinin B 0 GUINEA PIG::P01356
Residue:114
BDBM50040671
NameBDBM50040671
Synonyms:1-[5-(3-Aza-bicyclo[3.2.2]non-3-yl)-1-methyl-2-oxo-2,3-dihydro-1H-benzo[e][1,4]diazepin-3-yl]-3-m-tolyl-urea L-740,093
TypeSmall organic molecule
Emp. Form.C26H31N5O2
Mol. Mass.445.5566
SMILESCN1c2ccccc2C(=NC(NC(=O)Nc2cccc(C)c2)C1=O)N1CC2CCC(CC2)C1