Reaction Details
Target5-hydroxytryptamine receptor 1A
LigandBDBM50044418
Substrate/Competitorn/a
Ki 0.6±n/a nM
CommentsPDSP_825
Citation Boess, FGMartin, IL Molecular biology of 5-HT receptors. Neuropharmacology33:275-317 (1994) 
 
5-hydroxytryptamine receptor 1A
Name:5-hydroxytryptamine receptor 1A
Type:n/a
Mol. Mass.:46122.49
Organism:Homo sapiens (Human)
Description:n/a
Residue:422
BDBM50044418
NameBDBM50044418
Synonyms:4-Fluoro-N-{2-[4-(2-hydroxymethyl-2,3-dihydro-benzo[1,4]dioxin-5-yl)-piperazin-1-yl]-ethyl}-benzamide((+)-flesinoxan) FLESINOXAN
TypeSmall organic molecule
Emp. Form.C22H26FN3O4
Mol. Mass.415.4579
SMILESOCC1COc2c(O1)cccc2N1CCN(CCNC(=O)c2ccc(F)cc2)CC1