Reaction Details
Target5-hydroxytryptamine receptor 1B
LigandBDBM50014406
Substrate/Competitorn/a
Ki 512.86±n/a nM
CommentsPDSP_154
Citation Boess, FGMartin, IL Molecular biology of 5-HT receptors. Neuropharmacology33:275-317 (1994) 
 
5-hydroxytryptamine receptor 1B
Name:5-hydroxytryptamine receptor 1B
Type:G Protein-Coupled Receptor (GPCR)
Mol. Mass.:43579.17
Organism:Homo sapiens (Human)
Description:Receptor binding assays were performed using human clone stably expressed in CHO cells
Residue:390
BDBM50014406
NameBDBM50014406
Synonyms:2-Me 5-HT 2-methyl-5-HT 3-(2-aminoethyl)-2-methyl-1H-indol-5-ol CHEMBL266591
TypeSmall organic molecule
Emp. Form.C11H14N2O
Mol. Mass.190.2417
SMILESCc1[nH]c2ccc(O)cc2c1CCN