Reaction Details
Target5-hydroxytryptamine receptor 1D
LigandBDBM50007407
Substrate/Competitorn/a
Ki 7.41±n/a nM
CommentsPDSP_32
Citation Boess, FGMartin, IL Molecular biology of 5-HT receptors. Neuropharmacology33:275-317 (1994) 
 
5-hydroxytryptamine receptor 1D
Name:5-hydroxytryptamine receptor 1D
Type:G Protein-Coupled Receptor (GPCR)
Mol. Mass.:41920.63
Organism:Homo sapiens (Human)
Description:Receptor binding assays were performed using human clone stably expressed in CHO cells.
Residue:377
BDBM50007407
NameBDBM50007407
Synonyms:1-NP 4-Naphthalen-1-yl-piperazin-1-ium | CHEMBL277120
TypeSmall organic molecule
Emp. Form.C14H16N2
Mol. Mass.212.2902
SMILESC1CN(CCN1)c1cccc2ccccc12