Reaction Details
Target5-hydroxytryptamine receptor 1E
LigandBDBM21392
Substrate/Competitorn/a
Ki 3311.31±n/a nM
CommentsPDSP_140
Citation Boess, FGMartin, IL Molecular biology of 5-HT receptors. Neuropharmacology33:275-317 (1994) 
 
5-hydroxytryptamine receptor 1E
Name:5-hydroxytryptamine receptor 1E
Type:G Protein-Coupled Receptor (GPCR)
Mol. Mass.:41697.80
Organism:Homo sapiens (Human)
Description:gi_112822
Residue:365
BDBM21392
NameBDBM21392
Synonyms:3-(2-aminoethyl)-1H-indole-5-carboxamide 5-CT,DP CHEMBL1256863 [3H]-5-CT [3H]-5-Carboxyamidotryptamine | [3H]-5-carboxamidotryptamine
TypeSmall organic molecule
Emp. Form.C11H13N3O
Mol. Mass.203.2404
SMILESNCCc1c[nH]c2ccc(cc12)C(N)=O