Reaction Details
Target5-hydroxytryptamine receptor 1E
LigandBDBM81781
Substrate/Competitorn/a
Ki 120.22±n/a nM
CommentsPDSP_155
Citation Boess, FGMartin, IL Molecular biology of 5-HT receptors. Neuropharmacology33:275-317 (1994) 
 
5-hydroxytryptamine receptor 1E
Name:5-hydroxytryptamine receptor 1E
Type:G Protein-Coupled Receptor (GPCR)
Mol. Mass.:41697.80
Organism:Homo sapiens (Human)
Description:gi_112822
Residue:365
BDBM81781
NameBDBM81781
Synonyms:5-HT,a-Me | 5-HT,omega-N-Me
Typen/a
Emp. Form.C11H14N2O
Mol. Mass.190.2417
SMILESCn1cc(CCN)c2cc(O)ccc12