Reaction Details
Target5-hydroxytryptamine receptor 1F
LigandBDBM10755
Substrate/Competitorn/a
Ki 10±n/a nM
CommentsPDSP_150
Citation Boess, FGMartin, IL Molecular biology of 5-HT receptors. Neuropharmacology33:275-317 (1994) 
 
5-hydroxytryptamine receptor 1F
Name:5-hydroxytryptamine receptor 1F
Type:Enzyme Catalytic Domain
Mol. Mass.:41724.68
Organism:Homo sapiens (Human)
Description:5-HT1F HTR1F HUMAN::P30939
Residue:366
BDBM10755
NameBDBM10755
Synonyms:14C-5-hydroxy tryptamine creatinine disulfate 5-HT 5-hydroxy tryptamine creatinine disulfate Serotonin | [3H]-5-HT
TypeSmall organic molecule
Emp. Form.C10H12N2O
Mol. Mass.176.2151
SMILESNCCc1c[nH]c2ccc(O)cc12