Reaction Details
Target5-hydroxytryptamine receptor 2A
LigandBDBM28582
Substrate/Competitorn/a
Ki 0.79±n/a nM
CommentsPDSP_719
Citation Boess, FGMartin, IL Molecular biology of 5-HT receptors. Neuropharmacology33:275-317 (1994) 
 
5-hydroxytryptamine receptor 2A
Name:5-hydroxytryptamine receptor 2A
Type:G Protein-Coupled Receptor (GPCR)
Mol. Mass.:52852.05
Organism:Rattus norvegicus (rat)
Description:Rat cortex membranes 5-HT2A receptors.
Residue:471
BDBM28582
NameBDBM28582
Synonyms:1-(4-iodo-2,5-dimethoxyphenyl)propan-2-amine DOI DOI,(-) [125I]4-iodo-2,5-dimethoxyphenylisopropylamine | [125I]DOI
Typeradiolabeled ligand
Emp. Form.C11H16INO2
Mol. Mass.321.1547
SMILESCOc1cc(CC(C)N)c(OC)cc1I