Reaction Details
Target5-hydroxytryptamine receptor 5B
LigandBDBM50007406
Substrate/Competitorn/a
Ki 3981.07±n/a nM
CommentsPDSP_1808
Citation Boess, FGMartin, IL Molecular biology of 5-HT receptors. Neuropharmacology33:275-317 (1994) 
 
5-hydroxytryptamine receptor 5B
Name:5-hydroxytryptamine receptor 5B
Type:Enzyme Catalytic Domain
Mol. Mass.:41221.13
Organism:MOUSE
Description:5-HT5B 0 MOUSE::P31387
Residue:370
BDBM50007406
NameBDBM50007406
Synonyms:1-(3-(trifluoromethyl)phenyl)piperazine 1-(3-Trifluoromethyl-phenyl)-piperazine(TFMPP) TFMPP
TypeSmall organic molecule
Emp. Form.C11H13F3N2
Mol. Mass.230.2295
SMILESFC(F)(F)c1cccc(c1)N1CCNCC1