Reaction Details
Target5-hydroxytryptamine receptor 6
LigandBDBM50280053
Substrate/Competitorn/a
Ki 162.18±n/a nM
CommentsPDSP_667
Citation Boess, FGMartin, IL Molecular biology of 5-HT receptors. Neuropharmacology33:275-317 (1994) 
 
5-hydroxytryptamine receptor 6
Name:5-hydroxytryptamine receptor 6
Type:Enzyme Catalytic Domain
Mol. Mass.:46945.51
Organism:RAT
Description:5-HT6 HTR6 RAT::P31388
Residue:436
BDBM50280053
NameBDBM50280053
Synonyms:7-Methyl-4,6,6a,7,8,9,10,10a-octahydro-indolo[4,3-fg]quinoline-9-carboxylic acid ((2R,5S,10bS)-10b-hydroxy-5-isobutyl-2-isopropyl-3,6-dioxo-octahydro-oxazolo[3,2-a]pyrrolo[2,1-c]pyrazin-2-yl)-amide DHC | DIHYDROERGOCRYPTINE
TypeSmall organic molecule
Emp. Form.C32H43N5O5
Mol. Mass.577.7143
SMILESCC(C)C[C@@H]1N2C(=O)[C@](NC(=O)C3CC4C(Cc5c[nH]c6cccc4c56)N(C)C3)(O[C@@]2(O)C2CCCN2C1=O)C(C)C