Reaction Details
Target5-hydroxytryptamine receptor 7
LigandBDBM21397
Substrate/Competitorn/a
Ki 19.95±n/a nM
CommentsPDSP_1739
Citation Boess, FGMartin, IL Molecular biology of 5-HT receptors. Neuropharmacology33:275-317 (1994) 
 
5-hydroxytryptamine receptor 7
Name:5-hydroxytryptamine receptor 7
Type:G Protein-Coupled Receptor (GPCR)
Mol. Mass.:49852.62
Organism:Rattus norvegicus (rat)
Description:Rat cloned 5-HT7R.
Residue:448
BDBM21397
NameBDBM21397
Synonyms:8-[4-(4-fluorophenyl)-4-keto-butyl]-1-phenyl-1,3,8-triazaspiro[4.5]decan-4-one 8-[4-(4-fluorophenyl)-4-oxobutyl]-1-phenyl-1,3,8-triazaspiro[4.5]decan-4-one MLS000028615 SPIPERONE US9359372, Spiperone cid_5265
Typeradiolabeled ligand
Emp. Form.C23H26FN3O2
Mol. Mass.395.4698
SMILESFc1ccc(cc1)C(=O)CCCN1CCC2(CC1)N(CNC2=O)c1ccccc1