Reaction Details
TargetAdenosine receptor A2a
LigandBDBM29525
Substrate/Competitorn/a
Ki>10000±n/a nM
CommentsPDSP_880
Citation Gale, JDGrossman, CJWhitehead, JWOxford, AWBunce, KTHumphrey, PP GR113808: a novel, selective antagonist with high affinity at the 5-HT4 receptor. Br J Pharmacol111:332-8 (1994) 
 
Adenosine receptor A2a
Name:Adenosine receptor A2a
Type:G Protein-Coupled Receptor (GPCR)
Mol. Mass.:45015.65
Organism:Rattus norvegicus (rat)
Description:Rat A2A receptors expressed in CHO cells.
Residue:410
BDBM29525
NameBDBM29525
Synonyms:3H-GR113808 GR 113808 [3H]GR113808
Typeradiolabeled ligand
Emp. Form.C19H27N3O4S
Mol. Mass.393.5
SMILESCn1cc(C(=O)OCC2CCN(CCNS(C)(=O)=O)CC2)c2ccccc12