Reaction Details
TargetKynurenine/alpha-aminoadipate aminotransferase, mitochondrial
LigandBDBM273041
Substrate/Competitorn/a
Meas. Tech.KAT-II inhibitory assay
pH8±n/a
IC50 4.70±n/a nM
Commentsextracted
Citation Okuyama, MFukunaga, KUsui, KHayashi, NIijima, DHoriuchi, HItagaki, N Bicyclic or tricyclic heterocyclic compound US Patent US10065972 Publication Date 9/4/2018
 
Kynurenine/alpha-aminoadipate aminotransferase, mitochondrial
Name:Kynurenine/alpha-aminoadipate aminotransferase, mitochondrial
Type:Enzyme
Mol. Mass.:47353.09
Organism:Homo sapiens (Human)
Description:Q8N5Z0
Residue:425
BDBM273041
NameBDBM273041
Synonyms:(R)-2-[5-(3-methyl-[1,2,4]oxadiazol-5-yl)-7-oxo-6,7-dihydro[1,3]thiazolo[5,4-d]pyrimidin-2-yl]pyrrolidine-1-carboxylic acid phenyl ester | US10065972, Example 120
TypeSmall organic molecule
Emp. Form.C19H16N6O4S
Mol. Mass.424.433
SMILESCc1noc(n1)-c1nc2sc(nc2c(=O)[nH]1)[C@H]1CCCN1C(=O)Oc1ccccc1