Reaction Details
TargetKynurenine/alpha-aminoadipate aminotransferase, mitochondrial
LigandBDBM273089
Substrate/Competitorn/a
Meas. Tech.KAT-II inhibitory assay
pH8±n/a
IC50 11.0±n/a nM
Commentsextracted
Citation Okuyama, MFukunaga, KUsui, KHayashi, NIijima, DHoriuchi, HItagaki, N Bicyclic or tricyclic heterocyclic compound US Patent US10065972 Publication Date 9/4/2018
 
Kynurenine/alpha-aminoadipate aminotransferase, mitochondrial
Name:Kynurenine/alpha-aminoadipate aminotransferase, mitochondrial
Type:Enzyme
Mol. Mass.:47353.09
Organism:Homo sapiens (Human)
Description:Q8N5Z0
Residue:425
BDBM273089
NameBDBM273089
Synonyms:(R)-N-benzyl-1-{5-difluoromethyl-7-oxo-6-[(tetrahydro-2H-pyran-4-yl)methyl]-6,7-dihydro-[1,3]thiazolo[5,4-d]pyrimidin-2-yl}pyrrolidine-2-carboxamide | US10065972, Example 254
TypeSmall organic molecule
Emp. Form.C24H27F2N5O3S
Mol. Mass.503.565
SMILESFC(F)c1nc2sc(nc2c(=O)n1CC1CCOCC1)N1CCC[C@@H]1C(=O)NCc1ccccc1