Reaction Details
TargetKynurenine/alpha-aminoadipate aminotransferase, mitochondrial
LigandBDBM273130
Substrate/Competitorn/a
Meas. Tech.KAT-II inhibitory assay
pH8±n/a
IC50 15.0±n/a nM
Commentsextracted
Citation Okuyama, MFukunaga, KUsui, KHayashi, NIijima, DHoriuchi, HItagaki, N Bicyclic or tricyclic heterocyclic compound US Patent US10065972 Publication Date 9/4/2018
 
Kynurenine/alpha-aminoadipate aminotransferase, mitochondrial
Name:Kynurenine/alpha-aminoadipate aminotransferase, mitochondrial
Type:Enzyme
Mol. Mass.:47353.09
Organism:Homo sapiens (Human)
Description:Q8N5Z0
Residue:425
BDBM273130
NameBDBM273130
Synonyms:(R)-N-benzyl-2-{N'-[5-(propan-2-yl)-7-oxo-6,7-dihydro[1,3]thiazolo[5,4-d]pyrimidin-2-yl]-N'-methylamino}propionamide | US10065972, Example 486
TypeSmall organic molecule
Emp. Form.C19H23N5O2S
Mol. Mass.385.483
SMILESCC(C)c1nc2sc(nc2c(=O)[nH]1)N(C)[C@H](C)C(=O)NCc1ccccc1