Reaction Details
TargetKynurenine/alpha-aminoadipate aminotransferase, mitochondrial
LigandBDBM273132
Substrate/Competitorn/a
Meas. Tech.KAT-II inhibitory assay
pH8±n/a
IC50 7.10±n/a nM
Commentsextracted
Citation Okuyama, MFukunaga, KUsui, KHayashi, NIijima, DHoriuchi, HItagaki, N Bicyclic or tricyclic heterocyclic compound US Patent US10065972 Publication Date 9/4/2018
 
Kynurenine/alpha-aminoadipate aminotransferase, mitochondrial
Name:Kynurenine/alpha-aminoadipate aminotransferase, mitochondrial
Type:Enzyme
Mol. Mass.:47353.09
Organism:Homo sapiens (Human)
Description:Q8N5Z0
Residue:425
BDBM273132
NameBDBM273132
Synonyms:(R)-1-[5-(2,4-difluorophenyl)-7-oxo-6,7-dihydro[1,3]thiazolo[5,4-d]pyrimidin-2-yl]N-((R)-1-phenylethyl)pyrrolidine-2-carboxamide | US10065972, Example 499
TypeSmall organic molecule
Emp. Form.C24H21F2N5O2S
Mol. Mass.481.518
SMILESC[C@@H](NC(=O)[C@H]1CCCN1c1nc2c(nc([nH]c2=O)-c2ccc(F)cc2F)s1)c1ccccc1