Reaction Details
TargetKynurenine/alpha-aminoadipate aminotransferase, mitochondrial
LigandBDBM273070
Substrate/Competitorn/a
Meas. Tech.KAT-II inhibitory assay
pH8±n/a
IC50 16.0±n/a nM
Commentsextracted
Citation Okuyama, MFukunaga, KUsui, KHayashi, NIijima, DHoriuchi, HItagaki, N Bicyclic or tricyclic heterocyclic compound US Patent US10065972 Publication Date 9/4/2018
 
Kynurenine/alpha-aminoadipate aminotransferase, mitochondrial
Name:Kynurenine/alpha-aminoadipate aminotransferase, mitochondrial
Type:Enzyme
Mol. Mass.:47353.09
Organism:Homo sapiens (Human)
Description:Q8N5Z0
Residue:425
BDBM273070
NameBDBM273070
Synonyms:(R)-N-benzyl-1-(6-methyl-7-oxo-5-phenyl-6,7-dihydro[1,3]thiazolo[5,4-d]pyrimidin-2-yl)pyrrolidine-2-carboxamide BDBM273119 BDBM273144 | US10065972, Example 178
TypeSmall organic molecule
Emp. Form.C24H23N5O2S
Mol. Mass.445.537
SMILESCn1c(nc2sc(nc2c1=O)N1CCC[C@@H]1C(=O)NCc1ccccc1)-c1ccccc1