Reaction Details
TargetNicotinic acetylcholine receptor
LigandBDBM82068
Substrate/Competitorn/a
Ki 35±n/a nM
CommentsPDSP_1315
Citation Khan, IMYaksh, TLTaylor, P Ligand specificity of nicotinic acetylcholine receptors in rat spinal cord: studies with nicotine and cytisine. J Pharmacol Exp Ther270:159-66 (1994) Nicotinic acetylcholine receptor
Name:Nicotinic acetylcholine receptor
Type:Enzyme Catalytic Domain
Mol. Mass.:2478.99
Organism:RAT
Description:n-AChR 0 RAT::Q62594
Residue:23
BDBM82068
NameBDBM82068
Synonyms:CHEMBL9732 Nicotine-L salicylate
Typen/a
Emp. Form.C10H14N2
Mol. Mass.162.2316
SMILESCN1CCC[C@@H]1c1cccnc1