Reaction Details
TargetNicotinic acetylcholine receptor
LigandBDBM82546
Substrate/Competitorn/a
Ki 5.2±n/a nM
CommentsPDSP_1340
Citation Khan, IMYaksh, TLTaylor, P Ligand specificity of nicotinic acetylcholine receptors in rat spinal cord: studies with nicotine and cytisine. J Pharmacol Exp Ther270:159-66 (1994) Nicotinic acetylcholine receptor
Name:Nicotinic acetylcholine receptor
Type:Enzyme Catalytic Domain
Mol. Mass.:2478.99
Organism:RAT
Description:n-AChR 0 RAT::Q62594
Residue:23
BDBM82546
NameBDBM82546
Synonyms:CAS_14721-69-8 N-methylcarbamylcholine | NMCC
TypeSmall organic molecule
Emp. Form.C7H17N2O2
Mol. Mass.161.2215
SMILESCNC(=O)OCC[N+](C)(C)C