Reaction Details
TargetNicotinic acetylcholine receptor
LigandBDBM82545
Substrate/Competitorn/a
Ki>10000±n/a nM
CommentsPDSP_1913
Citation Khan, IMYaksh, TLTaylor, P Ligand specificity of nicotinic acetylcholine receptors in rat spinal cord: studies with nicotine and cytisine. J Pharmacol Exp Ther270:159-66 (1994) Nicotinic acetylcholine receptor
Name:Nicotinic acetylcholine receptor
Type:Enzyme Catalytic Domain
Mol. Mass.:2478.99
Organism:RAT
Description:n-AChR 0 RAT::Q62594
Residue:23
BDBM82545
NameBDBM82545
Synonyms:CAS_441310 Trimethaphan
TypeSmall organic molecule
Emp. Form.C22H25N2OS
Mol. Mass.365.511
SMILESO=C1N(Cc2ccccc2)C2C[S+]3CCCC3C2N1Cc1ccccc1