Reaction Details
Target5-hydroxytryptamine receptor 2B
LigandBDBM81781
Substrate/Competitorn/a
Ki 10.5±n/a nM
CommentsPDSP_155
Citation Kursar, JDNelson, DLWainscott, DBBaez, M Molecular cloning, functional expression, and mRNA tissue distribution of the human 5-hydroxytryptamine2B receptor. Mol Pharmacol46:227-34 (1994) 5-hydroxytryptamine receptor 2B
Name:5-hydroxytryptamine receptor 2B
Type:Enzyme Catalytic Domain
Mol. Mass.:53668.47
Organism:RAT
Description:5-HT2B HTR2B RAT::P30994
Residue:479
BDBM81781
NameBDBM81781
Synonyms:5-HT,a-Me | 5-HT,omega-N-Me
Typen/a
Emp. Form.C11H14N2O
Mol. Mass.190.2417
SMILESCn1cc(CCN)c2cc(O)ccc12