Reaction Details
TargetMuscarinic acetylcholine receptor M1
LigandBDBM112777
Substrate/Competitorn/a
Ki 40±n/a nM
CommentsPDSP_1363
Citation Stanton, TBolden-Watson, CCusack, BRichelson, E Antagonism of the five cloned human muscarinic cholinergic receptors expressed in CHO-K1 cells by antidepressants and antihistaminics. Biochem Pharmacol45:2352-4 (1993) 
 
Muscarinic acetylcholine receptor M1
Name:Muscarinic acetylcholine receptor M1
Type:Protein
Mol. Mass.:51442.54
Organism:Homo sapiens (Human)
Description:P11229
Residue:460
BDBM112777
NameBDBM112777
Synonyms:NORTRIPTYLINE | US8629135, SW-02
TypeSmall organic molecule
Emp. Form.C19H21N
Mol. Mass.263.3767
SMILES[#6]-[#7]-[#6]-[#6]\[#6]=[#6]-1/c2ccccc2-[#6]-[#6]-c2ccccc-12