Reaction Details
TargetMuscarinic acetylcholine receptor M2
LigandBDBM50010859
Substrate/Competitorn/a
Ki 88±n/a nM
CommentsPDSP_973
Citation Stanton, TBolden-Watson, CCusack, BRichelson, E Antagonism of the five cloned human muscarinic cholinergic receptors expressed in CHO-K1 cells by antidepressants and antihistaminics. Biochem Pharmacol45:2352-4 (1993) 
 
Muscarinic acetylcholine receptor M2
Name:Muscarinic acetylcholine receptor M2
Type:GPCR
Mol. Mass.:51730.61
Organism:Homo sapiens (Human)
Description:P08172
Residue:466
BDBM50010859
NameBDBM50010859
Synonyms:CHEMBL11 IMIPRAMINE PAMOATE | Imipramin
TypeSmall organic molecule
Emp. Form.C19H24N2
Mol. Mass.280.4073
SMILESCN(C)CCCN1c2ccccc2CCc2ccccc12