Reaction Details
TargetMuscarinic acetylcholine receptor M4
LigandBDBM112777
Substrate/Competitorn/a
Ki 84±n/a nM
CommentsPDSP_1363
Citation Stanton, TBolden-Watson, CCusack, BRichelson, E Antagonism of the five cloned human muscarinic cholinergic receptors expressed in CHO-K1 cells by antidepressants and antihistaminics. Biochem Pharmacol45:2352-4 (1993) 
 
Muscarinic acetylcholine receptor M4
Name:Muscarinic acetylcholine receptor M4
Type:Enzyme Catalytic Domain
Mol. Mass.:53079.31
Organism:Homo sapiens (Human)
Description:Cholinergic, muscarinic M4 CHRM4 HUMAN M3::P08173
Residue:479
BDBM112777
NameBDBM112777
Synonyms:NORTRIPTYLINE | US8629135, SW-02
TypeSmall organic molecule
Emp. Form.C19H21N
Mol. Mass.263.3767
SMILES[#6]-[#7]-[#6]-[#6]\[#6]=[#6]-1/c2ccccc2-[#6]-[#6]-c2ccccc-12