Reaction Details
TargetMuscarinic acetylcholine receptor M4
LigandBDBM82071
Substrate/Competitorn/a
Ki>10000±n/a nM
CommentsPDSP_1947
Citation Stanton, TBolden-Watson, CCusack, BRichelson, E Antagonism of the five cloned human muscarinic cholinergic receptors expressed in CHO-K1 cells by antidepressants and antihistaminics. Biochem Pharmacol45:2352-4 (1993) 
 
Muscarinic acetylcholine receptor M4
Name:Muscarinic acetylcholine receptor M4
Type:Enzyme Catalytic Domain
Mol. Mass.:53079.31
Organism:Homo sapiens (Human)
Description:Cholinergic, muscarinic M4 CHRM4 HUMAN M3::P08173
Residue:479
BDBM82071
NameBDBM82071
Synonyms:CAS_93413-69-5 NSC_62923 Venlafaxine hydrochloride WY-45655
TypeSmall organic molecule
Emp. Form.C17H27NO2
Mol. Mass.277.4018
SMILESCOc1ccc(cc1)C(CN(C)C)C1(O)CCCCC1