Reaction Details
TargetSomatostatin receptor type 4
LigandBDBM82547
Substrate/Competitorn/a
Ki 0.32±n/a nM
CommentsPDSP_1765
Citation Demchyshyn, LLSrikant, CBSunahara, RKKent, GSeeman, PVan Tol, HHPanetta, RPatel, YCNiznik, HB Cloning and expression of a human somatostatin-14-selective receptor variant (somatostatin receptor 4) located on chromosome 20. Mol Pharmacol43:894-901 (1993) Somatostatin receptor type 4
Name:Somatostatin receptor type 4
Type:Enzyme
Mol. Mass.:42015.38
Organism:Homo sapiens (Human)
Description:P31391
Residue:388
BDBM82547
NameBDBM82547
Synonyms:SRIF-D-Trp8
TypeSmall organic molecule
Emp. Form.C76H104N18O19S2
Mol. Mass.1637.878
SMILESC[C@@H](O)[C@@H]1NC(=O)[C@H](Cc2ccccc2)NC(=O)[C@@H](NC(=O)[C@H](CCCCN)NC(=O)[C@@H](Cc2c[nH]c3ccccc23)NC(=O)[C@H](Cc2ccccc2)NC(=O)[C@H](Cc2ccccc2)NC(=O)[C@H](CC(N)=O)NC(=O)[C@H](CCCCN)NC(=O)[C@H](CSSC[C@H](NC(=O)[C@H](CO)NC1=O)C(O)=O)NC(=O)CNC(=O)[C@H](C)N)[C@@H](C)O