Reaction Details
TargetDelta-type opioid receptor
LigandBDBM50105085
Substrate/Competitorn/a
Ki 1000±n/a nM
CommentsPDSP_1277
Citation Raynor, KKong, HChen, YYasuda, KYu, LBell, GIReisine, T Pharmacological characterization of the cloned kappa-, delta-, and mu-opioid receptors. Mol Pharmacol45:330-4 (1994) 
 
Delta-type opioid receptor
Name:Delta-type opioid receptor
Type:G Protein-Coupled Receptor (GPCR)
Mol. Mass.:40382.98
Organism:Homo sapiens (Human)
Description:Competition binding assays were carried out using membrane preparations from transfected HN9.10 cells that constitutively expressed the delta opioid receptor.
Residue:372
BDBM50105085
NameBDBM50105085
Synonyms:17-cyclobutylmethyl-4,5alpha-epoxymorphinan-3,6alpha,14-triol N-cyclobutylmethyl-4,5alpha-epoxy-3,6alpha,14-morphinantriol US10231963, Table B.1 US11534436, Compound Table B.1 US9656961, Example 00118 | USRE49340, Rank 9
TypeSmall organic molecule
Emp. Form.C21H27NO4
Mol. Mass.357.4434
SMILESO[C@H]1CC[C@@]2(O)[C@H]3Cc4ccc(O)c5O[C@@H]1[C@]2(CCN3CC1CCC1)c45