Reaction Details
TargetDelta-type opioid receptor
LigandBDBM83436
Substrate/Competitorn/a
Ki 1000±n/a nM
CommentsPDSP_1741
Citation Raynor, KKong, HChen, YYasuda, KYu, LBell, GIReisine, T Pharmacological characterization of the cloned kappa-, delta-, and mu-opioid receptors. Mol Pharmacol45:330-4 (1994) 
 
Delta-type opioid receptor
Name:Delta-type opioid receptor
Type:G Protein-Coupled Receptor (GPCR)
Mol. Mass.:40382.98
Organism:Homo sapiens (Human)
Description:Competition binding assays were carried out using membrane preparations from transfected HN9.10 cells that constitutively expressed the delta opioid receptor.
Residue:372
BDBM83436
NameBDBM83436
Synonyms:2-(3,4-dichlorophenyl)-N-methyl-N-[(5R,7S,8S)-7-(1-pyrrolidinyl)-1-oxaspiro[4.5]decan-8-yl]acetamide;methanesulfonic acid 2-(3,4-dichlorophenyl)-N-methyl-N-[(5R,7S,8S)-7-pyrrolidin-1-yl-1-oxaspiro[4.5]decan-8-yl]ethanamide;methanesulfonic acid MLS002153429 Spiradoline cid_55651
TypeSmall organic molecule
Emp. Form.C22H30Cl2N2O2
Mol. Mass.425.392
SMILESCN([C@H]1CC[C@@]2(CCCO2)C[C@@H]1N1CCCC1)C(=O)Cc1ccc(Cl)c(Cl)c1