Reaction Details
TargetKappa-type opioid receptor
LigandBDBM82553
Substrate/Competitorn/a
Ki 2.8±n/a nM
CommentsPDSP_362
Citation Raynor, KKong, HChen, YYasuda, KYu, LBell, GIReisine, T Pharmacological characterization of the cloned kappa-, delta-, and mu-opioid receptors. Mol Pharmacol45:330-4 (1994) 
 
Kappa-type opioid receptor
Name:Kappa-type opioid receptor
Type:G Protein-Coupled Receptor (GPCR)
Mol. Mass.:42648.76
Organism:Homo sapiens (Human)
Description:P41145
Residue:380
BDBM82553
NameBDBM82553
Synonyms:BETA-FUNALTREXAMINE b-FNA-HCl
TypeSmall organic molecule
Emp. Form.C25H30N2O6
Mol. Mass.454.5155
SMILESCOC(=O)\C=C\C(=O)NC1CC[C@]2(O)[C@H]3Cc4ccc(O)c5O[C@@H]1[C@]2(CCN3CC1CC1)c45