Reaction Details
TargetKappa-type opioid receptor
LigandBDBM50018708
Substrate/Competitorn/a
Ki 1000±n/a nM
CommentsPDSP_758
Citation Raynor, KKong, HChen, YYasuda, KYu, LBell, GIReisine, T Pharmacological characterization of the cloned kappa-, delta-, and mu-opioid receptors. Mol Pharmacol45:330-4 (1994) 
 
Kappa-type opioid receptor
Name:Kappa-type opioid receptor
Type:G Protein-Coupled Receptor (GPCR)
Mol. Mass.:42648.76
Organism:Homo sapiens (Human)
Description:P41145
Residue:380
BDBM50018708
NameBDBM50018708
Synonyms:2-{2-[2-(2-{2-[2-Amino-3-(4-hydroxy-phenyl)-propionylamino]-3-hydroxy-propionylamino}-acetylamino)-3-phenyl-propionylamino]-4-methyl-pentanoylamino}-3-hydroxy-butyric acid DSLET Tyr-D-Ser-Gly-Phe-Leu-Thr
TypeSmall organic molecule
Emp. Form.C33H46N6O10
Mol. Mass.686.7525
SMILESCC(C)C[C@H](NC(=O)[C@H](Cc1ccccc1)NC(=O)CNC(=O)[C@@H](CO)NC(=O)[C@@H](N)Cc1ccc(O)cc1)C(=O)N[C@@H]([C@@H](C)O)C(O)=O