Reaction Details
TargetMu-type opioid receptor
LigandBDBM50169774
Substrate/Competitorn/a
Ki 1000±n/a nM
CommentsPDSP_1935
Citation Raynor, KKong, HChen, YYasuda, KYu, LBell, GIReisine, T Pharmacological characterization of the cloned kappa-, delta-, and mu-opioid receptors. Mol Pharmacol45:330-4 (1994) 
 
Mu-type opioid receptor
Name:Mu-type opioid receptor
Type:G Protein-Coupled Receptor (GPCR)
Mol. Mass.:44789.51
Organism:Homo sapiens (Human)
Description:P35372
Residue:400
BDBM50169774
NameBDBM50169774
Synonyms:2-(3,4-Dichloro-phenyl)-N-methyl-N-(2-pyrrolidin-1-yl-cyclohexyl)-acetamide; compound with methanesulfonic acid U-50488H | U50,488H
TypeSmall organic molecule
Emp. Form.C19H26Cl2N2O
Mol. Mass.369.329
SMILESCN(C1CCCC[C@H]1N1CCCC1)C(=O)Cc1ccc(Cl)c(Cl)c1