Reaction Details
TargetMu-type opioid receptor
LigandBDBM21130
Substrate/Competitorn/a
Ki 1000±n/a nM
CommentsPDSP_1936
Citation Raynor, KKong, HChen, YYasuda, KYu, LBell, GIReisine, T Pharmacological characterization of the cloned kappa-, delta-, and mu-opioid receptors. Mol Pharmacol45:330-4 (1994) 
 
Mu-type opioid receptor
Name:Mu-type opioid receptor
Type:G Protein-Coupled Receptor (GPCR)
Mol. Mass.:44789.51
Organism:Homo sapiens (Human)
Description:P35372
Residue:400
BDBM21130
NameBDBM21130
Synonyms:N-methyl-2-phenyl-N-[(5R,7S,8S)-7-(pyrrolidin-1-yl)-1-oxaspiro[4.5]decan-8-yl]acetamide U-69593 [3H]U69593
Typeradiolabeled ligand
Emp. Form.C22H32N2O2
Mol. Mass.356.5017
SMILESCN([C@H]1CC[C@@]2(CCCO2)C[C@@H]1N1CCCC1)C(=O)Cc1ccccc1