Reaction Details
TargetMelatonin receptor
LigandBDBM50043289
Substrate/Competitorn/a
Ki 4±n/a nM
CommentsPDSP_7419
Citation Morgan, PJBarrett, PHowell, HEHelliwell, R Melatonin receptors: localization, molecular pharmacology and physiological significance. Neurochem Int24:101-46 (1994) 
 
Melatonin receptor
Name:Melatonin receptor
Type:Enzyme Catalytic Domain
Mol. Mass.:13287.02
Organism:RABBIT
Description:Q9BE38
Residue:114
BDBM50043289
NameBDBM50043289
Synonyms:CHEMBL34730 N-[2-(6-Chloro-5-methoxy-1H-indol-3-yl)-ethyl]-acetamide(6-Chloromelatonin) | melatonin, 6-Chloro
TypeSmall organic molecule
Emp. Form.C13H15ClN2O2
Mol. Mass.266.723
SMILESCOc1cc2c(CCNC(C)=O)c[nH]c2cc1Cl