Reaction Details
TargetMelatonin receptor
LigandBDBM29612
Substrate/Competitorn/a
Ki 3000±n/a nM
CommentsPDSP_1708
Citation Morgan, PJBarrett, PHowell, HEHelliwell, R Melatonin receptors: localization, molecular pharmacology and physiological significance. Neurochem Int24:101-46 (1994) 
 
Melatonin receptor
Name:Melatonin receptor
Type:Enzyme Catalytic Domain
Mol. Mass.:13287.02
Organism:RABBIT
Description:Q9BE38
Residue:114
BDBM29612
NameBDBM29612
Synonyms:CHEMBL33103 JOH-MSK-a63bdd1d-4 N-Acetyl-5-hydroxytryptamine N-acetylserotonin Serotonin,N-acetyl
TypeSmall organic molecule
Emp. Form.C12H14N2O2
Mol. Mass.218.2518
SMILESCC(=O)NCCc1c[nH]c2ccc(O)cc12