Reaction Details
Target5-hydroxytryptamine receptor 6
LigandBDBM82247
Substrate/Competitorn/a
Ki 2511.88±n/a nM
CommentsPDSP_1685
Citation Unsworth, CDMolinoff, PB Characterization of a 5-hydroxytryptamine receptor in mouse neuroblastoma N18TG2 cells. J Pharmacol Exp Ther269:246-55 (1994) 
 
5-hydroxytryptamine receptor 6
Name:5-hydroxytryptamine receptor 6
Type:Enzyme Catalytic Domain
Mol. Mass.:47012.98
Organism:MOUSE
Description:5-HT6 HTR6 MOUSE::Q9R1C8
Residue:440
BDBM82247
NameBDBM82247
Synonyms:8-Chloro-3-methyl-5-phenyl-2,3,4,5-tetrahydro-1H-benzo[d]azepin-7-ol(SCH 23390) CHEMBL2158641 SCH 23388 SCH 23390 (R-enantiomer) | SCH 23390,R(+)
TypeSmall organic molecule
Emp. Form.C17H18ClNO
Mol. Mass.287.784
SMILESCN1CCc2cc(Cl)c(O)cc2[C@H](C1)c1ccccc1