Reaction Details
Target5-hydroxytryptamine receptor 5B
LigandBDBM21393
Substrate/Competitorn/a
Ki 46±n/a nM
CommentsPDSP_205
Citation Wisden, WParker, EMMahle, CDGrisel, DANowak, HPYocca, FDFelder, CCSeeburg, PHVoigt, MM Cloning and characterization of the rat 5-HT5B receptor. Evidence that the 5-HT5B receptor couples to a G protein in mammalian cell membranes. FEBS Lett333:25-31 (1993) 
 
5-hydroxytryptamine receptor 5B
Name:5-hydroxytryptamine receptor 5B
Type:Enzyme Catalytic Domain
Mol. Mass.:41141.95
Organism:RAT
Description:5-HT5B 0 RAT::P35365
Residue:370
BDBM21393
NameBDBM21393
Synonyms:7-(dipropylamino)-5,6,7,8-tetrahydronaphthalen-1-ol 8-OH-DPAT 8-OH-DPAT,(-) CHEMBL1788118 CHEMBL56 US10562853, Compound 8-OH-DPAT cid_1220
Typeradiolabeled ligand
Emp. Form.C16H25NO
Mol. Mass.247.3758
SMILESCCCN(CCC)C1CCc2cccc(O)c2C1