Reaction Details
Target5-hydroxytryptamine receptor 5B
LigandBDBM55121
Substrate/Competitorn/a
Ki 1000±n/a nM
CommentsPDSP_728
Citation Wisden, WParker, EMMahle, CDGrisel, DANowak, HPYocca, FDFelder, CCSeeburg, PHVoigt, MM Cloning and characterization of the rat 5-HT5B receptor. Evidence that the 5-HT5B receptor couples to a G protein in mammalian cell membranes. FEBS Lett333:25-31 (1993) 
 
5-hydroxytryptamine receptor 5B
Name:5-hydroxytryptamine receptor 5B
Type:Enzyme Catalytic Domain
Mol. Mass.:41141.95
Organism:RAT
Description:5-HT5B 0 RAT::P35365
Residue:370
BDBM55121
NameBDBM55121
Synonyms:3-HYDROXYTYRAMINE HYDROCHLORIDE 4-(2-aminoethyl)pyrocatechol;hydrochloride Dopamine SMR000059081 | cid_65340
TypeSmall organic molecule
Emp. Form.C8H11NO2
Mol. Mass.153.1784
SMILESNCCc1ccc(O)c(O)c1