Reaction Details
Target5-hydroxytryptamine receptor 6
LigandBDBM50007407
Substrate/Competitorn/a
Ki 104±n/a nM
CommentsPDSP_32
Citation Bard, JAZgombick, JAdham, NVaysse, PBranchek, TAWeinshank, RL Cloning of a novel human serotonin receptor (5-HT7) positively linked to adenylate cyclase. J Biol Chem268:23422-6 (1993) 5-hydroxytryptamine receptor 6
Name:5-hydroxytryptamine receptor 6
Type:G Protein-Coupled Receptor (GPCR)
Mol. Mass.:46968.43
Organism:Homo sapiens (Human)
Description:P50406
Residue:440
BDBM50007407
NameBDBM50007407
Synonyms:1-NP 4-Naphthalen-1-yl-piperazin-1-ium | CHEMBL277120
TypeSmall organic molecule
Emp. Form.C14H16N2
Mol. Mass.212.2902
SMILESC1CN(CCN1)c1cccc2ccccc12