Reaction Details
TargetMuscarinic acetylcholine receptor M3
LigandBDBM82559
Substrate/Competitorn/a
Ki 645.659±n/a nM
CommentsPDSP_123
Citation Melchiorre, CBolognesi, MLChiarini, AMinarini, ASpampinato, S Synthesis and biological activity of some methoctramine-related tetraamines bearing a 11-acetyl-5,11-dihydro-6H-pyrido[2,3-b][1,4]-benzodiazepin-6-one moiety as antimuscarinics: a second generation of highly selective M2 muscarinic receptor antagonists. J Med Chem36:3734-7 (1993) 
 
Muscarinic acetylcholine receptor M3
Name:Muscarinic acetylcholine receptor M3
Type:Enzyme Catalytic Domain
Mol. Mass.:66086.66
Organism:RAT
Description:Cholinergic, muscarinic M3 CHRM3 RAT::P08483
Residue:589
BDBM82559
NameBDBM82559
Synonyms:methoctramine analog 5
TypeSmall organic molecule
Emp. Form.C60H75N13O3
Mol. Mass.1026.3228
SMILESCN(CCCCCCNCCCCCCCCNCCCCCCN(CN1c2ccccc2C(=O)Nc2cccnc12)CN1c2ccccc2C(=O)Nc2cccnc12)CN1c2ccccc2C(=O)Nc2cccnc12