Reaction Details
TargetD(2) dopamine receptor
LigandBDBM50008782
Substrate/Competitorn/a
Ki 0.12±n/a nM
CommentsPDSP_789
Citation Kessler, RMVotaw, JRde Paulis, TBingham, DRAnsari, MSMason, NSHolburn, GSchmidt, DEVotaw, DBManning, RG Evaluation of 5-[18F]fluoropropylepidepride as a potential PET radioligand for imaging dopamine D2 receptors. Synapse15:169-76 (1993) 
 
D(2) dopamine receptor
Name:D(2) dopamine receptor
Type:G Protein-Coupled Receptor (GPCR)
Mol. Mass.:50931.60
Organism:Rattus norvegicus (rat)
Description:P61169
Residue:444
BDBM50008782
NameBDBM50008782
Synonyms:CHEMBL44237 Epidepride;N-(1-Ethyl-pyrrolidin-2-ylmethyl)-5-iodo-2,3-dimethoxy-benzamide | N-(1-Ethyl-pyrrolidin-2-ylmethyl)-5-iodo-2,3-dimethoxy-benzamide (epidepride)
TypeSmall organic molecule
Emp. Form.C16H23IN2O3
Mol. Mass.418.2699
SMILESCCN1CCC[C@H]1CNC(=O)c1cc(I)cc(OC)c1OC