Reaction Details
TargetD(2) dopamine receptor
LigandBDBM82561
Substrate/Competitorn/a
Ki>10000±n/a nM
CommentsPDSP_3855
Citation Kessler, RMVotaw, JRde Paulis, TBingham, DRAnsari, MSMason, NSHolburn, GSchmidt, DEVotaw, DBManning, RG Evaluation of 5-[18F]fluoropropylepidepride as a potential PET radioligand for imaging dopamine D2 receptors. Synapse15:169-76 (1993) 
 
D(2) dopamine receptor
Name:D(2) dopamine receptor
Type:G Protein-Coupled Receptor (GPCR)
Mol. Mass.:50931.60
Organism:Rattus norvegicus (rat)
Description:P61169
Residue:444
BDBM82561
NameBDBM82561
Synonyms:CAS_40796-97-2 Tropanyl-3,5 dichlorobenzoate
TypeSmall organic molecule
Emp. Form.C15H17Cl2NO2
Mol. Mass.314.207
SMILESCN1[C@H]2CC[C@@H]1C[C@@H](C2)OC(=O)c1cc(Cl)cc(Cl)c1