Reaction Details
TargetD(3) dopamine receptor
LigandBDBM82566
Substrate/Competitorn/a
Ki 1.7±n/a nM
CommentsPDSP_241
Citation Freedman, SBPatel, SMarwood, REmms, FSeabrook, GRKnowles, MRMcAllister, G Expression and pharmacological characterization of the human D3 dopamine receptor. J Pharmacol Exp Ther268:417-26 (1994) D(3) dopamine receptor
Name:D(3) dopamine receptor
Type:n/a
Mol. Mass.:44243.43
Organism:Homo sapiens (Human)
Description:n/a
Residue:400
BDBM82566
NameBDBM82566
Synonyms:ADTN 6,7
TypeSmall organic molecule
Emp. Form.C24H21NO4
Mol. Mass.387.4278
SMILESNC1CCc2ccc(OC(=O)c3ccccc3)c(OC(=O)c3ccccc3)c2C1