Reaction Details
TargetCarboxy-terminal domain RNA polymerase II polypeptide A small phosphatase 1
LigandBDBM35401
Substrate/Competitorn/a
Meas. Tech.Dose Response confirmation of uHTS hits for Scp-1 phosphatase using a colorimetric assay
IC50 5327±453 nM
Citation PubChem, PC Dose Response confirmation of uHTS hits for Scp-1 phosphatase using a colorimetric assay PubChem Bioassay(2011)[AID]
 
Carboxy-terminal domain RNA polymerase II polypeptide A small phosphatase 1
Name:Carboxy-terminal domain RNA polymerase II polypeptide A small phosphatase 1
Type:Enzyme Catalytic Domain
Mol. Mass.:29199.89
Organism:Homo sapiens (Human)
Description:gi_10864009
Residue:261
BDBM35401
NameBDBM35401
Synonyms:3-hydroxy-2-phenyl-2,3-dihydro-1,5-benzothiazepin-4(5H)-one 3-oxidanyl-2-phenyl-3,5-dihydro-2H-1,5-benzothiazepin-4-one SMR000028182 | cid_3242458
TypeSmall organic molecule
Emp. Form.C15H13NO2S
Mol. Mass.271.334
SMILESOC1C(Sc2ccccc2NC1=O)c1ccccc1